[esb-build] Nightly build report - 11/01/2007 12:43:46 AM PDT

classic Classic list List threaded Threaded
1 message Options
Reply | Threaded
Open this post in threaded view
|

[esb-build] Nightly build report - 11/01/2007 12:43:46 AM PDT

WSO2 Builder
==> synapse_svn_log <==
A    trunk/java/repository/conf/sample/resources/vfs
A    trunk/java/repository/conf/sample/resources/vfs/test.xml
U    trunk/java/src/site/resources/Synapse_Configuration_Language.html
U    trunk/java/src/site/resources/Synapse_Samples.html
U    trunk/java/src/site/resources/Synapse_Samples_Setup.html
U    trunk/java/modules/extensions/src/test/java/org/apache/synapse/mediators/TestUtils.java
U    trunk/java/modules/extensions/src/test/java/org/apache/synapse/mediators/transform/XSLTMediatorTest.java
U    trunk/java/modules/extensions/src/main/java/org/apache/synapse/mediators/bsf/ScriptMediator.java
U    trunk/java/modules/transports/src/main/java/org/apache/synapse/transport/jms/JMSListener.java
U    trunk/java/modules/transports/src/main/java/org/apache/synapse/transport/base/AbstractTransportListener.java
U    trunk/java/modules/transports/src/main/java/org/apache/synapse/transport/vfs/VFSTransportListener.java
U    trunk/java/modules/transports/src/main/java/org/apache/synapse/transport/vfs/VFSTransportSender.java
U    trunk/java/modules/core/src/test/java/org/apache/synapse/registry/url/SimpleURLRegistryTest.java
U    trunk/java/modules/core/src/main/java/org/apache/synapse/mediators/transform/XSLTMediator.java
U    trunk/java/modules/core/src/main/java/org/apache/synapse/mediators/transform/HeaderMediator.java
U    trunk/java/modules/core/src/main/java/org/apache/synapse/config/xml/CloneMediatorFactory.java
A    trunk/java/modules/core/src/main/java/org/apache/synapse/util/FixedByteArrayOutputStream.java
A    trunk/java/modules/core/src/main/java/org/apache/synapse/util/TextFileDataSource.java
U    trunk/java/pom.xml
Updated to revision 590919.

==> synapse_build_log <==

Results :

Failed tests:

Tests in error:

Tests run: 25, Failures: 1, Errors: 18, Skipped: 0

[INFO] ------------------------------------------------------------------------
[ERROR] BUILD FAILURE
[INFO] ------------------------------------------------------------------------
[INFO] There are test failures.
[INFO] ------------------------------------------------------------------------
[INFO] For more information, run Maven with the -e switch
[INFO] ------------------------------------------------------------------------
[INFO] Total time: 7 minutes 53 seconds
[INFO] Finished at: Thu Nov 01 00:40:41 PDT 2007
[INFO] Final Memory: 21M/59M
[INFO] ------------------------------------------------------------------------

==> commons_svn_log <==
At revision 9365.

==> commons_utils_build_log <==
[WARNING] POM for 'jaxen:jaxen:pom:1.1-beta-9:compile' is invalid. It will be ignored for artifact resolution. Reason: Not a v4.0.0 POM.
[INFO] [surefire:test]
[INFO] No tests to run.
[INFO] [jar:jar]
[INFO] Building jar: /home/builder/wso2esb/build/commons/utils/target/wso2utils-SNAPSHOT.jar
[INFO] Preparing source:jar
[WARNING] Removing: jar from forked lifecycle, to prevent recursive invocation.
[INFO] No goals needed for project - skipping
[INFO] [source:jar {execution: default}]
[INFO] Building jar: /home/builder/wso2esb/build/commons/utils/target/wso2utils-SNAPSHOT-sources.jar
[INFO] [install:install]
[INFO] Installing /home/builder/wso2esb/build/commons/utils/target/wso2utils-SNAPSHOT.jar to /home/builder/.synapse_m2/org/wso2/utils/wso2utils/SNAPSHOT/wso2utils-SNAPSHOT.jar
[INFO] Installing /home/builder/wso2esb/build/commons/utils/target/wso2utils-SNAPSHOT-sources.jar to /home/builder/.synapse_m2/org/wso2/utils/wso2utils/SNAPSHOT/wso2utils-SNAPSHOT-sources.jar
[INFO] ------------------------------------------------------------------------
[INFO] BUILD SUCCESSFUL
[INFO] ------------------------------------------------------------------------
[INFO] Total time: 13 seconds
[INFO] Finished at: Thu Nov 01 00:41:54 PDT 2007
[INFO] Final Memory: 8M/15M
[INFO] ------------------------------------------------------------------------

==> commons_adminui_build_log <==
[INFO] Deleting directory /home/builder/wso2esb/build/commons/adminui/www/target/site
[INFO] [site:attach-descriptor]
[INFO] [install:install]
[INFO] Installing /home/builder/wso2esb/build/commons/adminui/www/pom.xml to /home/builder/.synapse_m2/org/wso2/adminui/wso2adminui-www/SNAPSHOT/wso2adminui-www-SNAPSHOT.pom
[INFO]
[INFO]
[INFO] ------------------------------------------------------------------------
[INFO] Reactor Summary:
[INFO] ------------------------------------------------------------------------
[INFO] wso2adminui-parent .................................... SUCCESS [5.146s]
[INFO] wso2adminui ........................................... SUCCESS [8.795s]
[INFO] wso2adminui-www ....................................... SUCCESS [0.031s]
[INFO] ------------------------------------------------------------------------
[INFO] ------------------------------------------------------------------------
[INFO] BUILD SUCCESSFUL
[INFO] ------------------------------------------------------------------------
[INFO] Total time: 14 seconds
[INFO] Finished at: Thu Nov 01 00:42:11 PDT 2007
[INFO] Final Memory: 10M/19M
[INFO] ------------------------------------------------------------------------

==> commons_statistics_build_log <==
[INFO] Building jar: /home/builder/wso2esb/build/commons/statistics/modules/client/target/wso2statistics-client-SNAPSHOT-sources.jar
[INFO] [install:install]
[INFO] Installing /home/builder/wso2esb/build/commons/statistics/modules/client/target/wso2statistics-client-SNAPSHOT.jar to /home/builder/.synapse_m2/org/wso2/statistics/wso2statistics-client/SNAPSHOT/wso2statistics-client-SNAPSHOT.jar
[INFO] Installing /home/builder/wso2esb/build/commons/statistics/modules/client/target/wso2statistics-client-SNAPSHOT-sources.jar to /home/builder/.synapse_m2/org/wso2/statistics/wso2statistics-client/SNAPSHOT/wso2statistics-client-SNAPSHOT-sources.jar
[INFO]
[INFO]
[INFO] ------------------------------------------------------------------------
[INFO] Reactor Summary:
[INFO] ------------------------------------------------------------------------
[INFO] WSO2 Statistics module ................................ SUCCESS [5.476s]
[INFO] WSO2 Statistics module ................................ SUCCESS [7.197s]
[INFO] WSO2 Statistics service client ........................ SUCCESS [11.524s]
[INFO] ------------------------------------------------------------------------
[INFO] ------------------------------------------------------------------------
[INFO] BUILD SUCCESSFUL
[INFO] ------------------------------------------------------------------------
[INFO] Total time: 25 seconds
[INFO] Finished at: Thu Nov 01 00:42:38 PDT 2007
[INFO] Final Memory: 11M/22M
[INFO] ------------------------------------------------------------------------

==> commons_throttle_build_log <==
[INFO] [source:jar {execution: default}]
[INFO] Building jar: /home/builder/wso2esb/build/commons/throttle/target/wso2throttle-r9300-sources.jar
[WARNING] POM for 'jaxen:jaxen:pom:1.1-beta-9:compile' is invalid. It will be ignored for artifact resolution. Reason: Not a v4.0.0 POM.
[WARNING] POM for 'jaxen:jaxen:pom:1.1-beta-9:compile' is invalid. It will be ignored for artifact resolution. Reason: Not a v4.0.0 POM.
[INFO] [antrun:run {execution: mar}]
[INFO] Executing tasks
     [copy] Copying 1 file to /home/builder/wso2esb/build/commons/throttle/target
[INFO] Executed tasks
[INFO] [build-helper:attach-artifact {execution: mar}]
[INFO] [install:install]
[INFO] Installing /home/builder/wso2esb/build/commons/throttle/target/wso2throttle-r9300.jar to /home/builder/.synapse_m2/org/wso2/throttle/wso2throttle/r9300/wso2throttle-r9300.jar
[INFO] Installing /home/builder/wso2esb/build/commons/throttle/target/wso2throttle-r9300-sources.jar to /home/builder/.synapse_m2/org/wso2/throttle/wso2throttle/r9300/wso2throttle-r9300-sources.jar
[INFO] Installing /home/builder/wso2esb/build/commons/throttle/target/wso2throttle-r9300.mar to /home/builder/.synapse_m2/org/wso2/throttle/wso2throttle/r9300/wso2throttle-r9300.mar
[INFO] ------------------------------------------------------------------------
[INFO] BUILD SUCCESSFUL
[INFO] ------------------------------------------------------------------------
[INFO] Total time: 8 seconds
[INFO] Finished at: Thu Nov 01 00:42:48 PDT 2007
[INFO] Final Memory: 9M/16M
[INFO] ------------------------------------------------------------------------

==> esb_svn_log <==

==> esb_build_log <==
[WARNING] POM for 'dom4j:dom4j:pom:1.6.1:compile' is invalid. It will be ignored for artifact resolution. Reason: Not a v4.0.0 POM.
[WARNING] POM for 'geronimo-spec:geronimo-spec-jta:pom:1.0.1B-rc4:compile' is invalid. It will be ignored for artifact resolution. Reason: Not a v4.0.0 POM.
[WARNING] POM for 'dom4j:dom4j:pom:1.6:compile' is invalid. It will be ignored for artifact resolution. Reason: Not a v4.0.0 POM.
[INFO] [compiler:testCompile]
Compiling 38 source files to /home/builder/wso2esb/build/esb/trunk/modules/samples/target/test-classes
[INFO] ------------------------------------------------------------------------
[ERROR] BUILD FAILURE
[INFO] ------------------------------------------------------------------------
[INFO] Compilation failure

/home/builder/wso2esb/build/esb/trunk/modules/samples/src/test/java/org/apache/synapse/samples/n2n/AbstractAutomationTestCase.java:[55,21] axis2Repolocation has private access in org.apache.synapse.ServerManager


[INFO] ------------------------------------------------------------------------
[INFO] For more information, run Maven with the -e switch
[INFO] ------------------------------------------------------------------------
[INFO] Total time: 47 seconds
[INFO] Finished at: Thu Nov 01 00:43:41 PDT 2007
[INFO] Final Memory: 22M/46M
[INFO] ------------------------------------------------------------------------

_______________________________________________
Esb-java-dev mailing list
[hidden email]
http://wso2.org/cgi-bin/mailman/listinfo/esb-java-dev